[logback-dev] [continuum] BUILD FAILURE: Logback Access Module

John Noreplai noreply at pixie.qos.ch
Mon Apr 2 22:07:18 CEST 2007


Online report : http://localhost:8090/continuum/servlet/continuum/target/ProjectBuild.vm/view/ProjectBuild/id/47/buildId/3667
Build statistics:
  State: Failed
  Previous State: Failed
  Started at: Mon, 2 Apr 2007 22:07:01 +0200
  Finished at: Mon, 2 Apr 2007 22:07:18 +0200
  Total time: 17s
  Build Trigger: Forced
  Exit code: 1
  Building machine hostname: pixie
  Operating system : Linux(unknown)
  Java version : 1.5.0_08(Sun Microsystems Inc.)

Changes
      No files changed
  
****************************************************************************
Output:
****************************************************************************
[INFO] Scanning for projects...
[INFO] ----------------------------------------------------------------------------
[INFO] Building Logback Access Module
[INFO]    task-segment: [clean, install]
[INFO] ----------------------------------------------------------------------------
[INFO] [clean:clean]
[INFO] Deleting directory /opt/continuum-1.0.3/apps/continuum/working-directory/47/target
[INFO] Deleting directory /opt/continuum-1.0.3/apps/continuum/working-directory/47/target/classes
[INFO] Deleting directory /opt/continuum-1.0.3/apps/continuum/working-directory/47/target/test-classes
[INFO] [resources:resources]
[INFO] Using default encoding to copy filtered resources.
[INFO] [compiler:compile]
Compiling 65 source files to /opt/continuum-1.0.3/apps/continuum/working-directory/47/target/classes
[INFO] [retrotranslator:translate {execution: default}]
[INFO] Transforming 65 file(s) from /opt/continuum-1.0.3/apps/continuum/working-directory/47/target/classes to /opt/continuum-1.0.3/apps/continuum/working-directory/47/target/logback-access-0.9.6-SNAPSHOT-jdk14.jar.
[INFO] Transformation of 65 file(s) completed successfully.
[INFO] [resources:testResources]
[INFO] Using default encoding to copy filtered resources.
[INFO] [compiler:testCompile]
Compiling 22 source files to /opt/continuum-1.0.3/apps/continuum/working-directory/47/target/test-classes
[INFO] [surefire:test]
[INFO] Surefire report directory: /opt/continuum-1.0.3/apps/continuum/working-directory/47/target/surefire-reports

-------------------------------------------------------
 T E S T S
-------------------------------------------------------
Running ch.qos.logback.access.db.DBAppenderTest
[Server at 7bd63e39]: [Thread[main,5,main]]: checkRunning(false) entered
[Server at 7bd63e39]: [Thread[main,5,main]]: checkRunning(false) exited
[Server at 7bd63e39]: [Thread[main,5,main]]: setDatabaseName(0,test)
[Server at 7bd63e39]: [Thread[main,5,main]]: checkRunning(false) entered
[Server at 7bd63e39]: [Thread[main,5,main]]: checkRunning(false) exited
[Server at 7bd63e39]: [Thread[main,5,main]]: setDatabasePath(0,mem:test;sql.enforce_strict_size=true)
[Server at 4e99353f]: [Thread[main,5,main]]: checkRunning(false) entered
[Server at 4e99353f]: [Thread[main,5,main]]: checkRunning(false) exited
[Server at 4e99353f]: [Thread[main,5,main]]: setDatabaseName(0,test)
[Server at 4e99353f]: [Thread[main,5,main]]: checkRunning(false) entered
[Server at 4e99353f]: [Thread[main,5,main]]: checkRunning(false) exited
[Server at 4e99353f]: [Thread[main,5,main]]: setDatabasePath(0,mem:test;sql.enforce_strict_size=true)
[Server at 54bb7759]: [Thread[main,5,main]]: checkRunning(false) entered
[Server at 54bb7759]: [Thread[main,5,main]]: checkRunning(false) exited
[Server at 54bb7759]: [Thread[main,5,main]]: setDatabaseName(0,test)
[Server at 54bb7759]: [Thread[main,5,main]]: checkRunning(false) entered
[Server at 54bb7759]: [Thread[main,5,main]]: checkRunning(false) exited
[Server at 54bb7759]: [Thread[main,5,main]]: setDatabasePath(0,mem:test;sql.enforce_strict_size=true)
[Server at 70ba9340]: [Thread[main,5,main]]: checkRunning(false) entered
[Server at 70ba9340]: [Thread[main,5,main]]: checkRunning(false) exited
[Server at 70ba9340]: [Thread[main,5,main]]: setDatabaseName(0,test)
[Server at 70ba9340]: [Thread[main,5,main]]: checkRunning(false) entered
[Server at 70ba9340]: [Thread[main,5,main]]: checkRunning(false) exited
[Server at 70ba9340]: [Thread[main,5,main]]: setDatabasePath(0,mem:test;sql.enforce_strict_size=true)
Tests run: 4, Failures: 0, Errors: 0, Skipped: 0, Time elapsed: 0.773 sec
Running ch.qos.logback.access.jetty.JettyBasicTest
2007-04-02 22:07:16.654::INFO:  Logging to STDERR via org.mortbay.log.StdErrLog
2007-04-02 22:07:16.717::INFO:  jetty-6.1.1
2007-04-02 22:07:16.782::INFO:  Started SelectChannelConnector @ 0.0.0.0:1234
02/04/2007:22:07:16 +0200 localhost 127.0.0.1
02/04/2007:22:07:16 +0200 localhost 127.0.0.1
Tests run: 2, Failures: 0, Errors: 1, Skipped: 0, Time elapsed: 1.417 sec <<< FAILURE!
Running ch.qos.logback.access.filter.AccessStatsTest
Tests run: 1, Failures: 0, Errors: 0, Skipped: 0, Time elapsed: 0.009 sec
Running ch.qos.logback.access.pattern.ConverterTest
Tests run: 16, Failures: 0, Errors: 0, Skipped: 0, Time elapsed: 0.026 sec
Running ch.qos.logback.access.filter.StatsByDayTest
Tests run: 1, Failures: 0, Errors: 0, Skipped: 0, Time elapsed: 0.013 sec
Running ch.qos.logback.access.net.URLEvaluatorTest
Tests run: 3, Failures: 0, Errors: 0, Skipped: 0, Time elapsed: 0.012 sec
Running ch.qos.logback.access.net.SocketAppenderTest
Tests run: 2, Failures: 0, Errors: 0, Skipped: 0, Time elapsed: 0.13 sec

Results :
Tests run: 29, Failures: 0, Errors: 1, Skipped: 0

[INFO] ------------------------------------------------------------------------
[ERROR] BUILD FAILURE
[INFO] ------------------------------------------------------------------------
[INFO] There are test failures.
[INFO] ------------------------------------------------------------------------
[INFO] For more information, run Maven with the -e switch
[INFO] ------------------------------------------------------------------------
[INFO] Total time: 15 seconds
[INFO] Finished at: Mon Apr 02 22:07:18 CEST 2007
[INFO] Final Memory: 18M/169M
[INFO] ------------------------------------------------------------------------

****************************************************************************





More information about the logback-dev mailing list